{"text_format":"1","workbook":"xlsx","n_sheets":18,"sheets":["Start Instructions","Macros","Full Data Template","Local Response Team","LEDO Site Section","Owner Site Section","Electric Section","Water Section","Sewer Section","Natural Gas Section","Fiber Section","Rail Section","Airport Section","Owner LEDO Due Diligence Sect","Fort Union Site","\"EX\" Stand-Alone Site CDA","\"EX\" Ind Park Map CDA","InSite Section Subm Checklist"],"not_rendered":{"charts":0,"images":7,"macros":1,"external_links":24,"defined_names":1184,"comments":0,"pivot_tables":0},"unopened":[],"bounds":{"document_bytes":16777216,"sheet_cells":100000,"rows_first":2000,"rows_last":500,"rows_between":2000,"halvings":0,"cell_chars":16384,"cell_head_chars":4096},"cells_cut":0,"cells_raw":0,"read":"whole","date_system":"1900"}

{"sheet":"Start Instructions","index":0,"n_rows":36,"n_cols":4,"rows_kept":36,"cut":false,"hidden":false,"merged":[[18,3,18,4],[19,3,19,4],[20,3,20,4],[16,3,16,4],[17,3,17,4],[31,3,31,4],[32,3,32,4],[21,3,21,4],[22,3,22,4],[23,3,23,4],[24,3,24,4],[26,3,26,4],[27,3,27,4],[25,3,25,4],[28,3,28,4],[29,3,29,4],[30,3,30,4]]}
[]
[]
[null,null,"INSITE'S SITE AND COMMUNITY CLIENT READINESS PROGRAM"]
[null,null,"InSite's Site Selection Data Template to Compile Site Specs"]
[null,null,"Stand-Alone Site and/or Industrial Park Site(s):  Referenced as \"Site\" in Document"]
[null,null,"LEDO Input Data Template"]
[null,null,"© 2022 InSite LLC: Confidential and Proprietary Property of InSite, LLC. The data template will remain in its original condition (formatting, spelling, etc.) as submitted to InSite."]
[null,null,"Input Name of Stand-Alone Site or Industrial Park Submission","Fort Union Industrial Park"]
[null,null,"Is this Site Submission.....","An Industrial Park Site"]
[null,null,"Largest, contiguous, developable acreage (CDA) of site submission.  \nSee \"EX\" worksheet tabs.",460]
[null,null,"Submission street/physical address","3574 N. Garner Lake Rd"]
[null,null,"city","Gillette"]
[null,null,"county","Campbell"]
[null,null,"state","WY"]
[null,null,"zip code",82716]
{"$rows_left_out":22}
{"sheet":"Macros","index":1,"n_rows":174,"n_cols":6,"rows_kept":174,"cut":false,"hidden":true,"merged":[]}
[]
[null,"Class I",null,"Yes"]
[null,"Class II",null,"No"]
[null,"Class I and Class II",null,"Not Zoned Industrial"]
[null,"Yes"]
[null,"No",null,"Yes"]
[null,"Partial",null,"No"]
[null,null,null,"Zoned Industrial"]
[null,null,null,null,null,"Submitted"]
[null,null,null,"Yes",null,"Did Not Submit"]
[null,"Yes",null,"No",null,"No Study Completed"]
[null,"No | Must Provide",null,"Must Provide Comments"]
[]
[null,"Yes",null,null,null,"Yes"]
[null,"No",null,null,null,"No"]
{"$rows_left_out":160}
{"sheet":"Full Data Template","index":2,"n_rows":254,"n_cols":5,"rows_kept":254,"cut":false,"hidden":true,"merged":[[254,2,254,4],[6,2,6,4],[7,2,8,2],[7,3,8,3],[91,2,91,4],[97,2,97,4]]}
[]
[]
[null,null,"InSite's Stand-Alone/Industrial Park Site(s) Evaluation"]
[null,null,"LEDO Input Data Template"]
[null,null,"Highest and Best Use/Authentication Identification for Winning Jobs and Investment for your Community!"]
[null,null,"© 2021 InSite LLC: Confidential and Proprietary Property of InSite, LLC. The data template will remain in its original condition (formatting, spelling, etc.) as submitted to InSite."]
[null,null,"Current Stand-Alone Site/Industrial Park Input Information Template"]
[null,null,"Criteria","Response","Comments"]
[null,null,null,null,"Blue cells do not require data entry."]
[null,null,{"$f":"'LEDO Site Section'!C10","v":"Name of Stand-Alone Site or Industrial Park Submission"},{"$f":"'LEDO Site Section'!D10","v":"Fort Union Industrial Park"}]
[null,null,"LOCAL ECONOMIC DEVELOPMENT ORGANIZATION (LEDO) SECTION (to Include Owner Input)"]
[null,null,{"$f":"'LEDO Site Section'!#REF!","v":{"$error":"#REF!"}},{"$f":"VLOOKUP(C12,'LEDO Site Section'!$C$20:$D$64,2,0)","v":{"$error":"#REF!"}}]
[null,null,{"$f":"'LEDO Site Section'!C20","v":"Total available acreage of site"},{"$f":"VLOOKUP(C13,'LEDO Site Section'!$C$20:$D$64,2,0)","v":1200}]
[null,null,{"$f":"'LEDO Site Section'!C12","v":"Largest, contiguous, developable acreage (CDA) of site submission. See \"EX\" worksheet tabs."},{"$f":"VLOOKUP(C14,'LEDO Site Section'!$C$20:$D$64,2,0)","v":{"$error":"#N/A"}}]
[null,null,{"$f":"'LEDO Site Section'!C21","v":"minimum acreage owner is willing to subdivide"},{"$f":"VLOOKUP(C15,'LEDO Site Section'!$C$20:$D$21,2,0)","v":25}]
{"$rows_left_out":240}
{"sheet":"Local Response Team","index":3,"n_rows":25,"n_cols":4,"rows_kept":25,"cut":false,"hidden":false,"merged":[[25,2,25,4],[16,2,16,4],[7,3,7,4]]}
[]
[]
[null,null,"INSITE'S SITE AND COMMUNITY CLIENT READINESS PROGRAM"]
[null,null,"InSite's Site Selection Data Template to Compile Site Specs"]
[null,null,"Stand-Alone Site and/or Industrial Park Site(s):  Referenced as \"Site\" in Document"]
[null,null,"LEDO Input Data Template"]
[null,null,"© 2022 InSite LLC: Confidential and Proprietary Property of InSite, LLC. The data template will remain in its original condition (formatting, spelling, etc.) as submitted to InSite."]
[null,null,"Name of Stand-Alone Site or Industrial Park Submission","Fort Union Industrial Park"]
[null,null,"Is this Site Submission.....",{"$f":"'Start Instructions'!$D$9","v":"An Industrial Park Site"}]
[null,null,"Largest, contiguous, developable acreage (CDA) of site submission. See \"EX\" worksheet tabs.",{"$f":"'Start Instructions'!D10","v":460}]
[null,null,"Submission street/physical address",{"$f":"'Start Instructions'!$D$11","v":"3574 N. Garner Lake Rd"}]
[null,null,"city",{"$f":"'Start Instructions'!$D$12","v":"Gillette"}]
[null,null,"county",{"$f":"'Start Instructions'!$D$13","v":"Campbell"}]
[null,null,"state",{"$f":"'Start Instructions'!$D$14","v":"WY"}]
[null,null,"zip code",{"$f":"'Start Instructions'!$D$15","v":82716}]
{"$rows_left_out":11}
{"sheet":"LEDO Site Section","index":4,"n_rows":98,"n_cols":5,"rows_kept":98,"cut":false,"hidden":false,"merged":[[6,2,6,4],[7,2,8,2],[7,3,8,3],[9,3,9,4]]}
[]
[null,null,"INSITE'S SITE AND COMMUNITY CLIENT READINESS PROGRAM"]
[null,null,"InSite's Site Selection Data Template to Compile Site Specs"]
[null,null,"Stand-Alone Site and/or Industrial Park Site(s):  Referenced as \"Site\" in Document"]
[null,null,"LEDO Input Data Template"]
[null,null,"© 2022 InSite LLC: Confidential and Proprietary Property of InSite, LLC. The data template will remain in its original condition (formatting, spelling, etc.) as submitted to InSite."]
[null,null,"\"Designed For Currently\" Site Specs/Data Input Template"]
[null,null,"Criteria","Data/Response \nthis Column Only","Comments only in Gray Cells"]
[null,null,null,null,"Blue cells do not require data entry."]
[null,null,"Name of Stand-Alone Site or Industrial Park Submission",{"$f":"'Start Instructions'!$D$8","v":"Fort Union Industrial Park"}]
[null,null,"Is this Site Submission.....",{"$f":"'Start Instructions'!$D$9","v":"An Industrial Park Site"}]
[null,null,"Largest, contiguous, developable acreage (CDA) of site submission. See \"EX\" worksheet tabs.",{"$f":"'Start Instructions'!$D$10","v":460}]
[null,null,"Submission street/physical address",{"$f":"'Start Instructions'!$D$11","v":"3574 N. Garner Lake Rd"}]
[null,null,"city",{"$f":"'Start Instructions'!$D$12","v":"Gillette"}]
[null,null,"county",{"$f":"'Start Instructions'!$D$13","v":"Campbell"}]
{"$rows_left_out":84}
{"sheet":"Owner Site Section","index":5,"n_rows":47,"n_cols":5,"rows_kept":47,"cut":false,"hidden":false,"merged":[[6,2,6,4],[7,2,8,2],[7,3,8,3],[9,3,9,4]]}
[]
[null,null,"INSITE'S SITE AND COMMUNITY CLIENT READINESS PROGRAM"]
[null,null,"InSite's Site Selection Data Template to Compile Site Specs"]
[null,null,"Stand-Alone Site and/or Industrial Park Site(s):  Referenced as \"Site\" in Document"]
[null,null,"LEDO Input Data Template"]
[null,null,"© 2022 InSite LLC: Confidential and Proprietary Property of InSite, LLC. The data template will remain in its original condition (formatting, spelling, etc.) as submitted to InSite."]
[null,null,"\"Designed For Currently\" Site Specs/Data Input Template"]
[null,null,"Criteria","Data/Response \nthis Column Only","Comments only in Gray Cells"]
[null,null,null,null,"Blue cells do not require data entry."]
[null,null,"Name of Stand-Alone Site or Industrial Park Submission",{"$f":"'Start Instructions'!D8","v":"Fort Union Industrial Park"}]
[null,null,"Is this Site Submission.....",{"$f":"'Start Instructions'!D9","v":"An Industrial Park Site"}]
[null,null,"Largest, contiguous, developable acreage (CDA) of site submission. See \"EX\" worksheet tabs.",{"$f":"'Start Instructions'!D10","v":460}]
[null,null,"Submission street/physical address",{"$f":"'Start Instructions'!$D$11","v":"3574 N. Garner Lake Rd"}]
[null,null,"city",{"$f":"'Start Instructions'!$D$12","v":"Gillette"}]
[null,null,"county",{"$f":"'Start Instructions'!$D$13","v":"Campbell"}]
{"$rows_left_out":33}
{"sheet":"Electric Section","index":6,"n_rows":48,"n_cols":5,"rows_kept":48,"cut":false,"hidden":false,"merged":[[6,2,6,4],[7,2,8,2],[7,3,8,3],[9,3,9,4]]}
[]
[null,null,"INSITE'S SITE AND COMMUNITY CLIENT READINESS PROGRAM"]
[null,null,"InSite's Site Selection Data Template to Compile Site Specs"]
[null,null,"Stand-Alone Site and/or Industrial Park Site(s):  Referenced as \"Site\" in Document"]
[null,null,"LEDO Input Data Template"]
[null,null,"© 2022 InSite LLC: Confidential and Proprietary Property of InSite, LLC. The data template will remain in its original condition (formatting, spelling, etc.) as submitted to InSite."]
[null,null,"\"Designed For Currently\" Site Specs/Data Input Template"]
[null,null,"Criteria","Data/Response \nthis Column Only","Comments only in Gray Cells"]
[null,null,null,null,"Blue cells do not require data entry."]
[null,null,"Name of Stand-Alone Site or Industrial Park Submission",{"$f":"'Start Instructions'!D8","v":"Fort Union Industrial Park"}]
[null,null,"Is this Site Submission.....",{"$f":"'Start Instructions'!$D$9","v":"An Industrial Park Site"}]
[null,null,"Largest, contiguous, developable acreage (CDA) of site submission. See \"EX\" worksheet tabs.",{"$f":"'Start Instructions'!$D$10","v":460}]
[null,null,"Submission street/physical address",{"$f":"'Start Instructions'!$D$11","v":"3574 N. Garner Lake Rd"}]
[null,null,"city",{"$f":"'Start Instructions'!$D$12","v":"Gillette"}]
[null,null,"county",{"$f":"'Start Instructions'!$D$13","v":"Campbell"}]
{"$rows_left_out":34}
{"sheet":"Water Section","index":7,"n_rows":44,"n_cols":5,"rows_kept":44,"cut":false,"hidden":false,"merged":[[6,2,6,4],[7,2,8,2],[7,3,8,3],[9,3,9,4]]}
[]
[null,null,"INSITE'S SITE AND COMMUNITY CLIENT READINESS PROGRAM"]
[null,null,"InSite's Site Selection Data Template to Compile Site Specs"]
[null,null,"Stand-Alone Site and/or Industrial Park Site(s):  Referenced as \"Site\" in Document"]
[null,null,"LEDO Input Data Template"]
[null,null,"© 2022 InSite LLC: Confidential and Proprietary Property of InSite, LLC. The data template will remain in its original condition (formatting, spelling, etc.) as submitted to InSite."]
[null,null,"\"Designed For Currently\" Site Specs/Data Input Template"]
[null,null,"Criteria","Data/Response \nthis Column Only","Comments only in Gray Cells"]
[null,null,null,null,"Blue cells do not require data entry."]
[null,null,"Name of Stand-Alone Site or Industrial Park Submission",{"$f":"'Start Instructions'!D8","v":"Fort Union Industrial Park"}]
[null,null,"Is this Site Submission.....",{"$f":"'Start Instructions'!$D$9","v":"An Industrial Park Site"}]
[null,null,"Largest, contiguous, developable acreage (CDA) of site submission. See \"EX\" worksheet tabs.",{"$f":"'Start Instructions'!$D$10","v":460}]
[null,null,"Submission street/physical address",{"$f":"'Start Instructions'!$D$11","v":"3574 N. Garner Lake Rd"}]
[null,null,"city",{"$f":"'Start Instructions'!$D$12","v":"Gillette"}]
[null,null,"county",{"$f":"'Start Instructions'!$D$13","v":"Campbell"}]
{"$rows_left_out":30}
{"sheet":"Sewer Section","index":8,"n_rows":60,"n_cols":5,"rows_kept":60,"cut":false,"hidden":false,"merged":[[6,2,6,4],[7,2,8,2],[7,3,8,3],[9,3,9,4]]}
[]
[null,null,"INSITE'S SITE AND COMMUNITY CLIENT READINESS PROGRAM"]
[null,null,"InSite's Site Selection Data Template to Compile Site Specs"]
[null,null,"Stand-Alone Site and/or Industrial Park Site(s):  Referenced as \"Site\" in Document"]
[null,null,"LEDO Input Data Template"]
[null,null,"© 2022 InSite LLC: Confidential and Proprietary Property of InSite, LLC. The data template will remain in its original condition (formatting, spelling, etc.) as submitted to InSite."]
[null,null,"\"Designed For Currently\" Site Specs/Data Input Template"]
[null,null,"Criteria","Data/Response \nthis Column Only","Comments only in Gray Cells"]
[null,null,null,null,"Blue cells do not require data entry."]
[null,null,"Name of Stand-Alone Site or Industrial Park Submission",{"$f":"'Start Instructions'!D8","v":"Fort Union Industrial Park"}]
[null,null,"Is this Site Submission.....",{"$f":"'Start Instructions'!$D$9","v":"An Industrial Park Site"}]
[null,null,"Largest, contiguous, developable acreage (CDA) of site submission. See \"EX\" worksheet tabs.",{"$f":"'Start Instructions'!$D$10","v":460}]
[null,null,"Submission street/physical address",{"$f":"'Start Instructions'!$D$11","v":"3574 N. Garner Lake Rd"}]
[null,null,"city",{"$f":"'Start Instructions'!$D$12","v":"Gillette"}]
[null,null,"county",{"$f":"'Start Instructions'!$D$13","v":"Campbell"}]
{"$rows_left_out":46}
{"sheet":"Natural Gas Section","index":9,"n_rows":45,"n_cols":5,"rows_kept":45,"cut":false,"hidden":false,"merged":[[6,2,6,4],[7,2,8,2],[7,3,8,3],[9,3,9,4]]}
[]
[null,null,"INSITE'S SITE AND COMMUNITY CLIENT READINESS PROGRAM"]
[null,null,"InSite's Site Selection Data Template to Compile Site Specs"]
[null,null,"Stand-Alone Site and/or Industrial Park Site(s):  Referenced as \"Site\" in Document"]
[null,null,"LEDO Input Data Template"]
[null,null,"© 2022 InSite LLC: Confidential and Proprietary Property of InSite, LLC. The data template will remain in its original condition (formatting, spelling, etc.) as submitted to InSite."]
[null,null,"\"Designed For Currently\" Site Specs/Data Input Template"]
[null,null,"Criteria","Data/Response \nthis Column Only","Comments only in Gray Cells"]
[null,null,null,null,"Blue cells do not require data entry."]
[null,null,"Name of Stand-Alone Site or Industrial Park Submission",{"$f":"'Start Instructions'!D8","v":"Fort Union Industrial Park"}]
[null,null,"Is this Site Submission.....",{"$f":"'Start Instructions'!$D$9","v":"An Industrial Park Site"}]
[null,null,"Largest, contiguous, developable acreage (CDA) of site submission. See \"EX\" worksheet tabs.",{"$f":"'Start Instructions'!$D$10","v":460}]
[null,null,"Submission street/physical address",{"$f":"'Start Instructions'!$D$11","v":"3574 N. Garner Lake Rd"}]
[null,null,"city",{"$f":"'Start Instructions'!$D$12","v":"Gillette"}]
[null,null,"county",{"$f":"'Start Instructions'!$D$13","v":"Campbell"}]
{"$rows_left_out":31}
{"sheet":"Fiber Section","index":10,"n_rows":40,"n_cols":5,"rows_kept":40,"cut":false,"hidden":false,"merged":[[6,2,6,4],[7,2,8,2],[7,3,8,3],[9,3,9,4]]}
[]
[null,null,"INSITE'S SITE AND COMMUNITY CLIENT READINESS PROGRAM"]
[null,null,"InSite's Site Selection Data Template to Compile Site Specs"]
[null,null,"Stand-Alone Site and/or Industrial Park Site(s):  Referenced as \"Site\" in Document"]
[null,null,"LEDO Input Data Template"]
[null,null,"© 2022 InSite LLC: Confidential and Proprietary Property of InSite, LLC. The data template will remain in its original condition (formatting, spelling, etc.) as submitted to InSite."]
[null,null,"\"Designed For Currently\" Site Specs/Data Input Template"]
[null,null,"Criteria","Data/Response \nthis Column Only","Comments only in Gray Cells"]
[null,null,null,null,"Blue cells do not require data entry."]
[null,null,"Name of Stand-Alone Site or Industrial Park Submission",{"$f":"'Start Instructions'!D8","v":"Fort Union Industrial Park"}]
[null,null,"Is this Site Submission.....",{"$f":"'Start Instructions'!$D$9","v":"An Industrial Park Site"}]
[null,null,"Largest, contiguous, developable acreage (CDA) of site submission. See \"EX\" worksheet tabs.",{"$f":"'Start Instructions'!$D$10","v":460}]
[null,null,"Submission street/physical address",{"$f":"'Start Instructions'!$D$11","v":"3574 N. Garner Lake Rd"}]
[null,null,"city",{"$f":"'Start Instructions'!$D$12","v":"Gillette"}]
[null,null,"county",{"$f":"'Start Instructions'!$D$13","v":"Campbell"}]
{"$rows_left_out":26}
{"sheet":"Rail Section","index":11,"n_rows":51,"n_cols":5,"rows_kept":51,"cut":false,"hidden":false,"merged":[[6,2,6,4],[7,2,8,2],[7,3,8,3],[9,3,9,4]]}
[]
[null,null,"INSITE'S SITE AND COMMUNITY CLIENT READINESS PROGRAM"]
[null,null,"InSite's Site Selection Data Template to Compile Site Specs"]
[null,null,"Stand-Alone Site and/or Industrial Park Site(s):  Referenced as \"Site\" in Document"]
[null,null,"LEDO Input Data Template"]
[null,null,"© 2022 InSite LLC: Confidential and Proprietary Property of InSite, LLC. The data template will remain in its original condition (formatting, spelling, etc.) as submitted to InSite."]
[null,null,"\"Designed For Currently\" Site Specs/Data Input Template"]
[null,null,"Criteria","Data/Response \nthis Column Only","Comments only in Gray Cells"]
[null,null,null,null,"Blue cells do not require data entry."]
[null,null,"Name of Stand-Alone Site or Industrial Park Submission",{"$f":"'Start Instructions'!D8","v":"Fort Union Industrial Park"}]
[null,null,"Is this Site Submission.....",{"$f":"'Start Instructions'!$D$9","v":"An Industrial Park Site"}]
[null,null,"Largest, contiguous, developable acreage (CDA) of site submission. See \"EX\" worksheet tabs.",{"$f":"'Start Instructions'!$D$10","v":460}]
[null,null,"Submission street/physical address",{"$f":"'Start Instructions'!$D$11","v":"3574 N. Garner Lake Rd"}]
[null,null,"city",{"$f":"'Start Instructions'!$D$12","v":"Gillette"}]
[null,null,"county",{"$f":"'Start Instructions'!$D$13","v":"Campbell"}]
{"$rows_left_out":37}
{"sheet":"Airport Section","index":12,"n_rows":47,"n_cols":5,"rows_kept":47,"cut":false,"hidden":false,"merged":[[6,2,6,4],[7,2,8,2],[7,3,8,3],[9,3,9,4]]}
[]
[null,null,"INSITE'S SITE AND COMMUNITY CLIENT READINESS PROGRAM"]
[null,null,"InSite's Site Selection Data Template to Compile Site Specs"]
[null,null,"Stand-Alone Site and/or Industrial Park Site(s):  Referenced as \"Site\" in Document"]
[null,null,"LEDO Input Data Template"]
[null,null,"© 2022 InSite LLC: Confidential and Proprietary Property of InSite, LLC. The data template will remain in its original condition (formatting, spelling, etc.) as submitted to InSite."]
[null,null,"\"Designed For Currently\" Site Specs/Data Input Template"]
[null,null,"Criteria","Data/Response \nthis Column Only","Comments only in Gray Cells"]
[null,null,null,null,"Blue cells do not require data entry."]
[null,null,"Name of Stand-Alone Site or Industrial Park Submission",{"$f":"'Start Instructions'!D8","v":"Fort Union Industrial Park"}]
[null,null,"Is this Site Submission.....",{"$f":"'Start Instructions'!$D$9","v":"An Industrial Park Site"}]
[null,null,"Largest, contiguous, developable acreage (CDA) of site submission. See \"EX\" worksheet tabs.",{"$f":"'Start Instructions'!$D$10","v":460}]
[null,null,"Submission street/physical address",{"$f":"'Start Instructions'!$D$11","v":"3574 N. Garner Lake Rd"}]
[null,null,"city",{"$f":"'Start Instructions'!$D$12","v":"Gillette"}]
[null,null,"county",{"$f":"'Start Instructions'!$D$13","v":"Campbell"}]
{"$rows_left_out":33}
{"sheet":"Owner LEDO Due Diligence Sect","index":13,"n_rows":70,"n_cols":5,"rows_kept":70,"cut":false,"hidden":false,"merged":[[6,2,6,4],[7,2,8,2],[7,3,8,3],[9,3,9,4]]}
[]
[null,null,"INSITE'S SITE AND COMMUNITY CLIENT READINESS PROGRAM"]
[null,null,"InSite's Site Selection Data Template to Compile Site Specs"]
[null,null,"Stand-Alone Site and/or Industrial Park Site(s):  Referenced as \"Site\" in Document"]
[null,null,"LEDO Input Data Template"]
[null,null,"© 2022 InSite LLC: Confidential and Proprietary Property of InSite, LLC. The data template will remain in its original condition (formatting, spelling, etc.) as submitted to InSite."]
[null,null,"\"Designed For Currently\" Site Specs/Data Input Template"]
[null,null,"Criteria","Data/Response \nthis Column Only","Comments only in Gray Cells"]
[null,null,null,null,"Blue cells do not require data entry."]
[null,null,"Name of Stand-Alone Site or Industrial Park Submission",{"$f":"'Start Instructions'!D8","v":"Fort Union Industrial Park"}]
[null,null,"Is this Site Submission.....",{"$f":"'Start Instructions'!$D$9","v":"An Industrial Park Site"}]
[null,null,"Largest, contiguous, developable acreage (CDA) of site submission. See \"EX\" worksheet tabs.",{"$f":"'Start Instructions'!$D$10","v":460}]
[null,null,"Submission street/physical address",{"$f":"'Start Instructions'!$D$11","v":"3574 N. Garner Lake Rd"}]
[null,null,"city",{"$f":"'Start Instructions'!$D$12","v":"Gillette"}]
[null,null,"county",{"$f":"'Start Instructions'!$D$13","v":"Campbell"}]
{"$rows_left_out":56}
{"sheet":"Fort Union Site","index":14,"n_rows":0,"n_cols":0,"rows_kept":0,"cut":false,"hidden":false,"merged":[]}

{"sheet":"\"EX\" Stand-Alone Site CDA","index":15,"n_rows":6,"n_cols":3,"rows_kept":6,"cut":false,"hidden":false,"merged":[]}
[]
[null,null,"INSITE'S SITE AND COMMUNITY CLIENT READINESS PROGRAM"]
[null,null,"InSite's Site Selection Data Template to Compile Site Specs"]
[null,null,"Stand-Alone Site and/or Industrial Park Site(s):  Referenced as \"Site\" in Document"]
[null,null,"LEDO Input Data Template"]
[null,null,"© 2022 InSite LLC: Confidential and Proprietary Property of InSite, LLC. The data template will remain in its original condition (formatting, spelling, etc.) as submitted to InSite."]

{"sheet":"\"EX\" Ind Park Map CDA","index":16,"n_rows":6,"n_cols":3,"rows_kept":6,"cut":false,"hidden":false,"merged":[]}
[]
[null,null,"INSITE'S SITE AND COMMUNITY CLIENT READINESS PROGRAM"]
[null,null,"InSite's Site Selection Data Template to Compile Site Specs"]
[null,null,"Stand-Alone Site and/or Industrial Park Site(s):  Referenced as \"Site\" in Document"]
[null,null,"LEDO Input Data Template"]
[null,null,"© 2022 InSite LLC: Confidential and Proprietary Property of InSite, LLC. The data template will remain in its original condition (formatting, spelling, etc.) as submitted to InSite."]

{"sheet":"InSite Section Subm Checklist","index":17,"n_rows":60,"n_cols":17,"rows_kept":60,"cut":false,"hidden":false,"merged":[[6,2,6,4],[7,2,8,2],[7,3,8,3],[9,3,9,4]]}
[]
[null,null,"INSITE'S SITE AND COMMUNITY CLIENT READINESS PROGRAM"]
[null,null,"InSite's Site Selection Data Template to Compile Site Specs"]
[null,null,"Stand-Alone Site and/or Industrial Park Site(s):  Referenced as \"Site\" in Document"]
[null,null,"LEDO Input Data Template"]
[null,null,"© 2022 InSite LLC: Confidential and Proprietary Property of InSite, LLC. The data template will remain in its original condition (formatting, spelling, etc.) as submitted to InSite."]
[null,null,"\"Designed For Currently\" Site Specs/Data Input Template"]
[null,null,"Criteria","Data/Response \nthis Column Only","Comments only in Gray Cells"]
[null,null,null,null,"Blue cells do not require data entry."]
[null,null,"Name of Stand-Alone Site or Industrial Park Submission",{"$f":"'Start Instructions'!D8","v":"Fort Union Industrial Park"}]
[null,null,"Is this Site Submission.....",{"$f":"'Start Instructions'!$D$9","v":"An Industrial Park Site"}]
[null,null,"Largest, contiguous, developable acreage (CDA) of site submission. See \"EX\" worksheet tabs.",{"$f":"'Start Instructions'!$D$10","v":460}]
[null,null,"Submission street/physical address",{"$f":"'Start Instructions'!$D$11","v":"3574 N. Garner Lake Rd"}]
[null,null,"city",{"$f":"'Start Instructions'!$D$12","v":"Gillette"}]
[null,null,"county",{"$f":"'Start Instructions'!$D$13","v":"Campbell"}]
{"$rows_left_out":45}